Target
Acetylcholinesterase
Ligand
BDBM50050562
Substrate
Meas. Tech.
ChEMBL_1458377 (CHEMBL3369807)
IC50
>50000±n/a nM
Citation
 Alza, NPRichmond, VBaier, CJFreire, EBaggio, RMurray, AP Synthesis and cholinesterase inhibition of cativic acid derivatives. Bioorg Med Chem 22:3838-49 (2014)  
Target
Name:
Acetylcholinesterase
Synonyms:
3.1.1.7 Acetylcholinesterase (AChE) ache
Type:
Mol. Mass.:
65900.74
Organism:
Tetronarce californica (Pacific electric ray) (Torpedo californica)
Description:
P04058
Residue:
586
  
Inhibitor
Name:
BDBM50050562
Synonyms:
CHEMBL3309350
Type:
Small organic molecule
Emp. Form.:
C29H51NO4
Mol. Mass.:
477.7195
SMILES:
[H][C@@]12CC=C(CO)[C@H](CC[C@H](C)CC(=O)OCCCCCN3CCOCC3)[C@@]1(C)CCCC2(C)C
: