Target
Succinate-semialdehyde dehydrogenase, mitochondrial
Ligand
BDBM23411
Substrate
Meas. Tech.
ChEMBL_1459249 (CHEMBL3367479)
IC50
7200000±n/a nM
Citation
 Singh, MKaur, MSilakari, O Flavones: an important scaffold for medicinal chemistry. Eur J Med Chem 84:206-39 (2014)  
Target
Name:
Succinate-semialdehyde dehydrogenase, mitochondrial
Synonyms:
ALDH5A1 NAD(+)-dependent succinic semialdehyde dehydrogenase SSDH_HUMAN Succinate-semialdehyde dehydrogenase, mitochondrial
Type:
PROTEIN
Mol. Mass.:
57224.70
Organism:
Homo sapiens (Human)
Description:
ChEMBL_1459249
Residue:
535
  
Inhibitor
Name:
BDBM23411
Synonyms:
5,6,7-trihydroxy-2-(4-hydroxyphenyl)-4H-chromen-4-one Scutellarein Scutellarein (28) | US10252984, Table 2.2
Type:
flavone
Emp. Form.:
C15H10O6
Mol. Mass.:
286.2363
SMILES:
Oc1ccc(cc1)-c1cc(=O)c2c(O)c(O)c(O)cc2o1
: