Target
Carbonic anhydrase 9
Ligand
BDBM50051113
Substrate
Meas. Tech.
ChEMBL_1448692 (CHEMBL3372050)
Ki
165±n/a nM
Citation
 D'Ascenzio, MCarradori, SSecci, DVullo, DCeruso, MAkdemir, ASupuran, CT Selective inhibition of human carbonic anhydrases by novel amide derivatives of probenecid: synthesis, biological evaluation and molecular modelling studies. Bioorg Med Chem 22:3982-8 (2014)  
Target
Name:
Carbonic anhydrase 9
Synonyms:
CA-IX CAH9_HUMAN Carbonic anhydrase 9 (CA IX) Carbonic anhydrase 9 precursor Carbonic anhydrase IX (CAIX) Carbonic anhydrases; II & IX MN RCC-associated antigen G250
Type:
Enzyme
Mol. Mass.:
49669.03
Organism:
Homo sapiens (Human)
Description:
Catalytic domain of human cloned isozyme was used in the assay
Residue:
459
  
Inhibitor
Name:
BDBM50051113
Synonyms:
CHEMBL3310911
Type:
Small organic molecule
Emp. Form.:
C14H22N2O3S
Mol. Mass.:
298.401
SMILES:
CCCN(CCC)S(=O)(=O)c1ccc(cc1)C(=O)NC
: