Target
Fatty-acid amide hydrolase 1 [30-579]
Ligand
BDBM50052767
Substrate
Meas. Tech.
ChEMBL_1456648 (CHEMBL3370248)
Ki
100±n/a nM
Citation
 Otrubova, KSrinivasan, VBoger, DL Discovery libraries targeting the major enzyme classes: the serine hydrolases. Bioorg Med Chem Lett 24:3807-13 (2014)  
Target
Name:
Fatty-acid amide hydrolase 1 [30-579]
Synonyms:
Anandamide amidohydrolase 1 Faah Fatty Acid Amide Hydrolase Fatty-acid amide hydrolase (FAAH) Fatty-acid amide hydrolase 1 (FAAH) Oleamide hydrolase 1
Type:
Single-pass membrane protein; homodimer
Mol. Mass.:
60474.00
Organism:
Rattus norvegicus (rat)
Description:
P97612 (aa 30-579)
Residue:
550
  
Inhibitor
Name:
BDBM50052767
Synonyms:
CHEMBL3318612
Type:
Small organic molecule
Emp. Form.:
C23H26N4O2
Mol. Mass.:
390.4781
SMILES:
Cc1cnn(c1)C(=O)N1CCN(Cc2ccc(OCc3ccccc3)cc2)CC1
: