Target
Carbonic anhydrase 12
Ligand
BDBM50054647
Substrate
Meas. Tech.
ChEMBL_1453081 (CHEMBL3362530)
Ki
0.790000±n/a nM
Citation
 Pichake, JKharkar, PSCeruso, MSupuran, CTToraskar, MP Carbonic anhydrase inhibitors: design, synthesis, and biological evaluation of novel sulfonyl semicarbazide derivatives. ACS Med Chem Lett 5:793-6 (2014)  
Target
Name:
Carbonic anhydrase 12
Synonyms:
CA-XII CAH12_HUMAN Carbonic anhydrase Carbonic anhydrase XII Carbonic anhydrase XII (CAXII) | Tumor antigen HOM-RCC-3.1.3
Type:
Enzyme
Mol. Mass.:
39456.00
Organism:
Homo sapiens (Human)
Description:
Catalytic domain of human cloned isozyme was used in the assay
Residue:
354
  
Inhibitor
Name:
BDBM50054647
Synonyms:
CHEMBL3323208
Type:
Small organic molecule
Emp. Form.:
C13H13BrN4O5S2
Mol. Mass.:
449.3
SMILES:
NS(=O)(=O)c1ccc(NC(=O)NNS(=O)(=O)c2ccc(Br)cc2)cc1
: