Target
Transient receptor potential cation channel subfamily V member 1
Ligand
BDBM50055267
Substrate
Meas. Tech.
ChEMBL_1450483 (CHEMBL3379979)
EC50
6900±n/a nM
Citation
 Brizzi, AAiello, FMarini, PCascio, MGCorelli, FBrizzi, VDe Petrocellis, LLigresti, ALuongo, LLamponi, SMaione, SPertwee, RGDi Marzo, V Structure-affinity relationships and pharmacological characterization of new alkyl-resorcinol cannabinoid receptor ligands: Identification of a dual cannabinoid receptor/TRPA1 channel agonist. Bioorg Med Chem 22:4770-83 (2014)  
Target
Name:
Transient receptor potential cation channel subfamily V member 1
Synonyms:
Capsaicin receptor Osm-9-like TRP channel 1 TRPV1_HUMAN Transient receptor potential cation channel subfamily V member 1 (TRPV1) Transient receptor potential cation channel subfamily V member 1(TRPV1) Vanilloid VR1 Vanilloid receptor 1 Vanilloid receptor 1 (VRI/TRPV1)
Type:
Protein
Mol. Mass.:
94960.75
Organism:
Homo sapiens (Human)
Description:
Q8NER1
Residue:
839
  
Inhibitor
Name:
BDBM50055267
Synonyms:
CHEMBL3323682
Type:
Small organic molecule
Emp. Form.:
C26H43NO3
Mol. Mass.:
417.6245
SMILES:
CCCCCCC(C)(C)c1cc(O)cc(OCCCCCCCC(=O)NCC=C)c1
: