Target
Activin receptor type-1
Ligand
BDBM50056676
Substrate
Meas. Tech.
ChEMBL_1453224 (CHEMBL3365517)
IC50
960±n/a nM
Citation
 Mohedas, AHWang, YSanvitale, CECanning, PChoi, SXing, XBullock, ANCuny, GDYu, PB Structure-activity relationship of 3,5-diaryl-2-aminopyridine ALK2 inhibitors reveals unaltered binding affinity for fibrodysplasia ossificans progressiva causing mutants. J Med Chem 57:7900-15 (2014)  
Target
Name:
Activin receptor type-1
Synonyms:
ACVR1_MOUSE ActR-I Acvr Acvrlk2 | Tgfb1
Type:
Protein
Mol. Mass.:
57231.35
Organism:
Mus musculus
Description:
Residue:
509
  
Inhibitor
Name:
BDBM50056676
Synonyms:
CHEMBL3341789
Type:
Small organic molecule
Emp. Form.:
C25H29N3O3
Mol. Mass.:
419.5161
SMILES:
COc1cc(cc(OC)c1OC)-c1cc(cnc1C)-c1ccc(cc1)N1CCNCC1
: