Target
Activin receptor type-1
Ligand
BDBM50056506
Substrate
Meas. Tech.
ChEMBL_1453218 (CHEMBL3365511)
IC50
60±n/a nM
Citation
 Mohedas, AHWang, YSanvitale, CECanning, PChoi, SXing, XBullock, ANCuny, GDYu, PB Structure-activity relationship of 3,5-diaryl-2-aminopyridine ALK2 inhibitors reveals unaltered binding affinity for fibrodysplasia ossificans progressiva causing mutants. J Med Chem 57:7900-15 (2014)  
Target
Name:
Activin receptor type-1
Synonyms:
ACVR1_MOUSE ActR-I Acvr Acvrlk2 | Tgfb1
Type:
Protein
Mol. Mass.:
57231.35
Organism:
Mus musculus
Description:
Residue:
509
  
Inhibitor
Name:
BDBM50056506
Synonyms:
CHEMBL3341943 US11701353, Compound 382_0087_6488
Type:
Small organic molecule
Emp. Form.:
C21H23N3O5S
Mol. Mass.:
429.489
SMILES:
COc1cc(cc(OC)c1OC)-c1cc(cnc1N)-c1cccc(NS(C)(=O)=O)c1
: