Target
N-acetyllactosaminide beta-1,3-N-acetylglucosaminyltransferase 3
Ligand
BDBM50058694
Substrate
Meas. Tech.
ChEMBL_1448996 (CHEMBL3376893)
Ki
1200000±n/a nM
Citation
 Hanashima, SKorekane, HTaniguchi, NYamaguchi, Y Synthesis of N-glycan units for assessment of substrate structural requirements of N-acetylglucosaminyltransferase III. Bioorg Med Chem Lett 24:4533-7 (2014)  
Target
Name:
N-acetyllactosaminide beta-1,3-N-acetylglucosaminyltransferase 3
Synonyms:
B3GALT8 B3GN3_HUMAN BGnT-3 Beta-1,3-Gn-T3 Beta-1,3-galactosyl-O-glycosyl-glycoprotein beta-1,3-N-acetylglucosaminyltransferase Beta-3-Gx-T8 Beta3GalT8 Core 1 extending beta-1,3-N-acetylglucosaminyltransferase N-acetyllactosaminide beta-1,3-N-acetylglucosaminyltransferase 3 Transmembrane protein 3 UDP-GlcNAc:betaGal beta-1,3-N-acetylglucosaminyltransferase 3 b3Gal-T8
Type:
PROTEIN
Mol. Mass.:
42548.28
Organism:
Homo sapiens (Human)
Description:
ChEMBL_109464
Residue:
372
  
Inhibitor
Name:
BDBM50058694
Synonyms:
CHEMBL3326806
Type:
Small organic molecule
Emp. Form.:
C35H60N2O26
Mol. Mass.:
924.8487
SMILES:
[H][C@]1(O[C@H]2O[C@H](CO)[C@@H](O)[C@H](O)[C@]2([H])O[C@@H]2O[C@H](CO)[C@@H](O)[C@H](O)[C@H]2NC(C)=O)[C@H](O)[C@@H](CO[C@H]2O[C@H](CO)[C@@H](O)[C@H](O)[C@]2([H])O[C@@H]2O[C@H](CO)[C@@H](O)[C@H](O)[C@H]2NC(C)=O)O[C@H](OC)[C@H]1O
: