Target
Serine/threonine-protein kinase 3
Ligand
BDBM50059290
Substrate
Meas. Tech.
ChEMBL_1460602 (CHEMBL3395732)
IC50
2388±n/a nM
Citation
 Henderson, JLKormos, BLHayward, MMCoffman, KJJasti, JKurumbail, RGWager, TTVerhoest, PRNoell, GSChen, YNeedle, EBerger, ZSteyn, SJHoule, CHirst, WDGalatsis, P Discovery and preclinical profiling of 3-[4-(morpholin-4-yl)-7H-pyrrolo[2,3-d]pyrimidin-5-yl]benzonitrile (PF-06447475), a highly potent, selective, brain penetrant, and in vivo active LRRK2 kinase inhibitor. J Med Chem 58:419-32 (2015)  
Target
Name:
Serine/threonine-protein kinase 3
Synonyms:
KRS1 MST2 STE20-Like Kinase MST2 STK3_HUMAN Serine/threonine-protein kinase 3 (MST2) Serine/threonine-protein kinase Krs-1 | Serine/threonine-protein kinase MST2
Type:
Serine/threonine-protein kinase
Mol. Mass.:
56284.87
Organism:
Homo sapiens (Human)
Description:
Residue:
491
  
Inhibitor
Name:
BDBM50059290
Synonyms:
CHEMBL3393448 | US9156845, 110
Type:
Small organic molecule
Emp. Form.:
C20H17N7O2
Mol. Mass.:
387.3947
SMILES:
Cc1noc(n1)C1CN(CCO1)c1ncnc2[nH]cc(-c3cccc(c3)C#N)c12
: