Target
Aurora kinase A
Ligand
BDBM50059454
Substrate
Meas. Tech.
ChEMBL_1460905 (CHEMBL3396725)
IC50
2.0±n/a nM
Target
Name:
Aurora kinase A
Synonyms:
AIK ARK-1 AURA AURKA_HUMAN Aurora 2 Aurora kinase A (AURKA) Aurora kinase A (Aurora-2) Aurora/IPL1-related kinase 1 Breast tumor-amplified kinase IAK1 STK15 GN Serine/threonine kinase 15 Serine/threonine-protein kinase 6 Serine/threonine-protein kinase aurora-A aurora-2 | hARK1
Type:
Serine/threonine-protein kinase
Mol. Mass.:
45830.98
Organism:
Homo sapiens (Human)
Description:
O14965
Residue:
403
  
Inhibitor
Name:
BDBM50059454
Synonyms:
CHEMBL3393470
Type:
Small organic molecule
Emp. Form.:
C24H20N4O4S
Mol. Mass.:
460.505
SMILES:
COC(=O)c1[nH]cc2C(c3ccc(Sc4nc5ccccc5[nH]4)o3)C3=C(CCCC3=O)Nc12
: