Target
Platelet-derived growth factor subunit B
Ligand
BDBM50059654
Substrate
Meas. Tech.
ChEMBL_1460665 (CHEMBL3395906)
Kd
<1000±n/a nM
Citation
 Koch, PGehringer, MLaufer, SA Inhibitors of c-Jun N-terminal kinases: an update. J Med Chem 58:72-95 (2015)  
Target
Name:
Platelet-derived growth factor subunit B
Synonyms:
PDGF PDGFB Platelet-derived growth factor subunit B SIS
Type:
Enzyme
Mol. Mass.:
27298.80
Organism:
Homo sapiens (Human)
Description:
P01127
Residue:
241
  
Inhibitor
Name:
BDBM50059654
Synonyms:
CHEMBL2144409
Type:
Small organic molecule
Emp. Form.:
C28H26N8O
Mol. Mass.:
490.559
SMILES:
Cc1ccc(cn1)-c1ncn(n1)-c1ccc(Nc2nccc(n2)-c2cccc(c2)N2CCOCC2)cc1
: