Target
Non-receptor tyrosine-protein kinase TYK2
Ligand
BDBM50059654
Substrate
Meas. Tech.
ChEMBL_1460666 (CHEMBL3395907)
Kd
<1000±n/a nM
Citation
 Koch, PGehringer, MLaufer, SA Inhibitors of c-Jun N-terminal kinases: an update. J Med Chem 58:72-95 (2015)  
Target
Name:
Non-receptor tyrosine-protein kinase TYK2
Synonyms:
Non-receptor tyrosine-protein kinase TYK2 (TYK2) TYK2_HUMAN | Tyrosine-protein kinase TYK2
Type:
Protein
Mol. Mass.:
133666.03
Organism:
Homo sapiens (Human)
Description:
P29597
Residue:
1187
  
Inhibitor
Name:
BDBM50059654
Synonyms:
CHEMBL2144409
Type:
Small organic molecule
Emp. Form.:
C28H26N8O
Mol. Mass.:
490.559
SMILES:
Cc1ccc(cn1)-c1ncn(n1)-c1ccc(Nc2nccc(n2)-c2cccc(c2)N2CCOCC2)cc1
: