Target
Tyrosine-protein phosphatase non-receptor type 1
Ligand
BDBM50060921
Substrate
Meas. Tech.
ChEMBL_1462225 (CHEMBL3395157)
Ki
8900±n/a nM
Citation
 Nguyen, PHZhao, BTAli, MYChoi, JSRhyu, DYMin, BSWoo, MH Insulin-mimetic selaginellins from Selaginella tamariscina with protein tyrosine phosphatase 1B (PTP1B) inhibitory activity. J Nat Prod 78:34-42 (2015)  
Target
Name:
Tyrosine-protein phosphatase non-receptor type 1
Synonyms:
PTN1_HUMAN PTPN1 Protein tyrosine phosphatase-1B (PTP1B) Protein-tyrosine phosphatase 1B (PTP1B) Tyrosine-protein phosphatase non-receptor type 1 (PTP1B)
Type:
Protein phosphatase
Mol. Mass.:
49963.76
Organism:
Homo sapiens (Human)
Description:
Human recombinant GST-fusion PTP1B (1-435).
Residue:
435
  
Inhibitor
Name:
BDBM50060921
Synonyms:
CHEMBL3394770
Type:
Small organic molecule
Emp. Form.:
C35H26O5
Mol. Mass.:
526.5779
SMILES:
[#6]-[#8]-c1ccc(cc1)-[#6](=[#6]-1\[#6]=[#6]-[#6](=O)-[#6]=[#6]-1)\c1c(ccc(-[#6]-[#8])c1C#Cc1ccc(-[#8])cc1)-c1ccc(-[#8])cc1
: