Target
Tyrosine-protein phosphatase non-receptor type 1
Ligand
BDBM50060923
Substrate
Meas. Tech.
ChEMBL_1462224 (CHEMBL3395156)
IC50
700±n/a nM
Citation
 Nguyen, PHZhao, BTAli, MYChoi, JSRhyu, DYMin, BSWoo, MH Insulin-mimetic selaginellins from Selaginella tamariscina with protein tyrosine phosphatase 1B (PTP1B) inhibitory activity. J Nat Prod 78:34-42 (2015)  
Target
Name:
Tyrosine-protein phosphatase non-receptor type 1
Synonyms:
PTN1_HUMAN PTPN1 Protein tyrosine phosphatase-1B (PTP1B) Protein-tyrosine phosphatase 1B (PTP1B) Tyrosine-protein phosphatase non-receptor type 1 (PTP1B)
Type:
Protein phosphatase
Mol. Mass.:
49963.76
Organism:
Homo sapiens (Human)
Description:
Human recombinant GST-fusion PTP1B (1-435).
Residue:
435
  
Inhibitor
Name:
BDBM50060923
Synonyms:
CHEMBL3394773
Type:
Small organic molecule
Emp. Form.:
C15H10N2O3
Mol. Mass.:
266.2515
SMILES:
OC(=O)c1nnc(o1)-c1ccc(cc1)-c1ccccc1
: