Target
Histamine H4 receptor
Ligand
BDBM50061071
Substrate
Meas. Tech.
ChEMBL_1461284 (CHEMBL3396058)
EC50
>10000±n/a nM
Citation
 Savall, BMMeduna, SPTays, KCai, HThurmond, RLMcGovern, PGaul, MZhao, BPEdwards, JP Diaminopyrimidines, diaminopyridines and diaminopyridazines as histamine H4 receptor modulators. Bioorg Med Chem Lett 25:956-9 (2015)  
Target
Name:
Histamine H4 receptor
Synonyms:
AXOR35 GPCR105 HH4R HRH4 Histamine H4 receptor Histamine receptor (H3 and H4) SP9144
Type:
G Protein-Coupled Receptor (GPCR)
Mol. Mass.:
44517.02
Organism:
Homo sapiens (Human)
Description:
Binding assays were using CHO cells stably expressing hH4R receptors.
Residue:
390
  
Inhibitor
Name:
BDBM50061071
Synonyms:
CHEMBL3393535
Type:
Small organic molecule
Emp. Form.:
C17H26N4
Mol. Mass.:
286.4151
SMILES:
CN[C@H]1CCN(C1)c1ccnc(NC2CC3CCC2C3)c1
: