Target
Peroxisome proliferator-activated receptor alpha
Ligand
BDBM50063489
Substrate
Meas. Tech.
ChEMBL_1463126 (CHEMBL3399109)
IC50
>10000±n/a nM
Citation
 Zhang, HDing, CZLai, ZChen, SSDevasthale, PHerpin, TMorton, GQu, FRyono, DSmirk, RWang, WWu, SYe, XXLi, YXApedo, AFarrelly, DWang, TGu, LMorgan, NFlynn, NChu, CKunselman, LLippy, JLocke, KO'Malley, KHarrity, TCap, MZhang, LHosagrahara, VKadiyala, PXu, CDoweyko, AMZahler, RHariharan, NCheng, PT Synthesis and biological evaluation of novel pyrrolidine acid analogs as potent dual PPARa/¿ agonists. Bioorg Med Chem Lett 25:1196-205 (2015)  
Target
Name:
Peroxisome proliferator-activated receptor alpha
Synonyms:
NR1C1 PPAR PPAR-alpha PPARA_HUMAN Peroxisome proliferator-activated receptor | Peroxisome proliferator-activated receptor alpha (PPAR alpha)
Type:
Enzyme
Mol. Mass.:
52222.08
Organism:
Homo sapiens (Human)
Description:
Q07869
Residue:
468
  
Inhibitor
Name:
BDBM50063489
Synonyms:
CHEMBL3398457
Type:
Small organic molecule
Emp. Form.:
C32H32N2O6
Mol. Mass.:
540.6063
SMILES:
Cc1oc(nc1CCOc1cccc(CC[C@H]2CN(C[C@@H]2C(O)=O)C(=O)Oc2ccccc2)c1)-c1ccccc1
: