Target
Sphingosine 1-phosphate receptor 2
Ligand
BDBM50065615
Substrate
Meas. Tech.
ChEMBL_1463952 (CHEMBL3405604)
IC50
8.8±n/a nM
Citation
 Kusumi, KShinozaki, KKanaji, TKurata, HNaganawa, AOtsuki, KMatsushita, TSekiguchi, TKakuuchi, ASeko, T Discovery of novel S1P2 antagonists. Part 1: discovery of 1,3-bis(aryloxy)benzene derivatives. Bioorg Med Chem Lett 25:1479-82 (2015)  
Target
Name:
Sphingosine 1-phosphate receptor 2
Synonyms:
EDG5 S1PR2 Sphingosine 1-phosphate receptor Sphingosine-1-phosphate receptor 2 | ndothelial differentiation G-protein coupled receptor 5
Type:
G Protein-Coupled Receptor (GPCR)
Mol. Mass.:
38883.16
Organism:
Homo sapiens (Human)
Description:
Membranes isolated from S1P2-transfected CHO cells were used in ligand binding assay.
Residue:
353
  
Inhibitor
Name:
BDBM50065615
Synonyms:
CHEMBL3401387
Type:
Small organic molecule
Emp. Form.:
C33H40FN3O5
Mol. Mass.:
577.6862
SMILES:
CCC(CC)CC1(O)CCN(CC1)C(=O)Nc1cc(Oc2ccc(F)cc2)cc(Oc2ccc(cc2)C(=O)N(C)C)c1
: