Target
Bcl-2-like protein 1
Ligand
BDBM50067368
Substrate
Meas. Tech.
ChEMBL_1465156 (CHEMBL3405857)
Ki
870±n/a nM
Citation
 Wan, YWu, SXiao, GLiu, THou, XChen, CGuan, PYang, XFang, H Design, synthesis and preliminary bioactivity studies of 2-thioxo-4-thiazolidinone derivatives as Bcl-2 inhibitors. Bioorg Med Chem 23:1994-2003 (2015)  
Target
Name:
Bcl-2-like protein 1
Synonyms:
Anti-apoptotic Bcl-2 protein Apoptosis regulator Bcl-X BCL2-like 1 isoform 1 BCL2L1 Bcl-2-like protein 1 (Bcl-XL) Bcl-xL/Bcl-2-binding component 3 Bcl2-antagonist of cell death (BAD)
Type:
Mitochondrion membrane; Single-pass membrane protein
Mol. Mass.:
26039.60
Organism:
Homo sapiens (Human)
Description:
Residue:
233
  
Inhibitor
Name:
BDBM50067368
Synonyms:
CHEMBL3401812
Type:
Small organic molecule
Emp. Form.:
C32H21ClF3N3O6S3
Mol. Mass.:
732.169
SMILES:
[O-][N+](=O)c1cc(ccc1Cl)S(=O)(=O)NC(=O)[C@H](Cc1ccccc1)N1C(=S)S\C(=C/c2ccc(cc2)-c2ccc(cc2)C(F)(F)F)C1=O
: