Target
Carbonic anhydrase 9
Ligand
BDBM50067996
Substrate
Meas. Tech.
ChEMBL_1466433 (CHEMBL3406378)
Ki
2.6±n/a nM
Citation
 Bozdag, MCarta, FVullo, DAkdemir, AIsik, SLanzi, CScozzafava, AMasini, ESupuran, CT Synthesis of a new series of dithiocarbamates with effective human carbonic anhydrase inhibitory activity and antiglaucoma action. Bioorg Med Chem 23:2368-76 (2015)  
Target
Name:
Carbonic anhydrase 9
Synonyms:
CA-IX CAH9_HUMAN Carbonic anhydrase 9 (CA IX) Carbonic anhydrase 9 precursor Carbonic anhydrase IX (CAIX) Carbonic anhydrases; II & IX MN RCC-associated antigen G250
Type:
Enzyme
Mol. Mass.:
49669.03
Organism:
Homo sapiens (Human)
Description:
Catalytic domain of human cloned isozyme was used in the assay
Residue:
459
  
Inhibitor
Name:
BDBM50067996
Synonyms:
CHEMBL3400800
Type:
Small organic molecule
Emp. Form.:
C6H12NNaOS2
Mol. Mass.:
201.285
SMILES:
[Na+].OCCCCCNC([S-])=S
: