Target
Amine oxidase [flavin-containing] A
Ligand
BDBM50068023
Substrate
Meas. Tech.
ChEMBL_1463746 (CHEMBL3404560)
IC50
36000±n/a nM
Citation
 Engelbrecht, IPetzer, JPPetzer, A The synthesis and evaluation of sesamol and benzodioxane derivatives as inhibitors of monoamine oxidase. Bioorg Med Chem Lett 25:1896-900 (2015)  
Target
Name:
Amine oxidase [flavin-containing] A
Synonyms:
AOFA_HUMAN MAO-A Monoamine oxidase Monoamine oxidase type A (MAO A) Monoamine oxidase type A (MAOA)
Type:
Protein
Mol. Mass.:
59689.53
Organism:
Homo sapiens (Human)
Description:
P21397
Residue:
527
  
Inhibitor
Name:
BDBM50068023
Synonyms:
CHEMBL3402195
Type:
Small organic molecule
Emp. Form.:
C15H14O3
Mol. Mass.:
242.2699
SMILES:
C(Oc1ccc2OCCOc2c1)c1ccccc1
: