Target
Monoglyceride lipase
Ligand
BDBM50068217
Substrate
Meas. Tech.
ChEMBL_1464314 (CHEMBL3404581)
IC50
>141000±n/a nM
Citation
 Zhen, XLYin, WHTian, XMa, ZJFan, SMHan, JRLiu, S Synthesis and biological evaluation of open-chain analogs of cyclic peptides as inhibitors of cellular Shp2 activity. Bioorg Med Chem 23:2562-7 (2015)  
Target
Name:
Monoglyceride lipase
Synonyms:
HU-K5 Lysophospholipase-like MGL MGLL_HUMAN
Type:
Hydrolase
Mol. Mass.:
33264.56
Organism:
Homo sapiens (Human)
Description:
Human recombinant MGL (Cayman Chemical, cat# 10008354).
Residue:
303
  
Inhibitor
Name:
BDBM50068217
Synonyms:
CHEMBL3403316
Type:
Small organic molecule
Emp. Form.:
C38H56N6O7
Mol. Mass.:
708.8872
SMILES:
CCN(CC)C(=O)[C@H](Cc1ccc2ccccc2c1)NC(=O)[C@H](CC(C)C)NC(=O)[C@@H](NC(=O)[C@@H](N)COC(=O)[C@@H]1CCCN1C(C)=O)C(C)C
: