Target
Hepatocyte growth factor activator
Ligand
BDBM50069117
Substrate
Meas. Tech.
ChEMBL_1466697 (CHEMBL3404295)
Ki
14000±n/a nM
Citation
 Franco, FMJones, DEHarris, PKHan, ZWildman, SAJarvis, CMJanetka, JW Structure-based discovery of small molecule hepsin and HGFA protease inhibitors: Evaluation of potency and selectivity derived from distinct binding pockets. Bioorg Med Chem 23:2328-43 (2015)  
Target
Name:
Hepatocyte growth factor activator
Synonyms:
HGF activator HGFAC Hepatocyte growth factor activator Hepatocyte growth factor activator short chain
Type:
PROTEIN
Mol. Mass.:
70690.18
Organism:
Homo sapiens (Human)
Description:
ChEMBL_109514
Residue:
655
  
Inhibitor
Name:
BDBM50069117
Synonyms:
CHEMBL3403529
Type:
Small organic molecule
Emp. Form.:
C32H34N6O4S
Mol. Mass.:
598.715
SMILES:
NC(=N)c1cccc(C[C@H](NS(=O)(=O)c2ccc3ccccc3c2)C(=O)N2CCN(CC2)C(=O)NCc2ccccc2)c1
: