Target
Prostaglandin G/H synthase 2
Ligand
BDBM50070488
Substrate
Meas. Tech.
ChEMBL_1467708 (CHEMBL3411145)
IC50
29100±n/a nM
Citation
 Alanazi, AMEl-Azab, ASAl-Suwaidan, IAElTahir, KEAsiri, YAAbdel-Aziz, NIAbdel-Aziz, AA Structure-based design of phthalimide derivatives as potential cyclooxygenase-2 (COX-2) inhibitors: anti-inflammatory and analgesic activities. Eur J Med Chem 92:115-23 (2015)  
Target
Name:
Prostaglandin G/H synthase 2
Synonyms:
COX2 Cyclooxygenase-2 (COX-2) PTGS2 Prostaglandin G/H synthase (cyclooxygenase)
Type:
Protein
Mol. Mass.:
68976.98
Organism:
Ovis aries (Sheep)
Description:
Residue:
603
  
Inhibitor
Name:
BDBM50070488
Synonyms:
CHEMBL3408779
Type:
Small organic molecule
Emp. Form.:
C20H21NO3
Mol. Mass.:
323.3856
SMILES:
COc1ccc(CN2C(=O)c3ccc(cc3C2=O)C(C)(C)C)cc1
: