Target
Prostaglandin G/H synthase 2
Ligand
BDBM50070480
Substrate
Meas. Tech.
ChEMBL_1467708 (CHEMBL3411145)
IC50
30700±n/a nM
Citation
 Alanazi, AMEl-Azab, ASAl-Suwaidan, IAElTahir, KEAsiri, YAAbdel-Aziz, NIAbdel-Aziz, AA Structure-based design of phthalimide derivatives as potential cyclooxygenase-2 (COX-2) inhibitors: anti-inflammatory and analgesic activities. Eur J Med Chem 92:115-23 (2015)  
Target
Name:
Prostaglandin G/H synthase 2
Synonyms:
COX2 Cyclooxygenase-2 (COX-2) PTGS2 Prostaglandin G/H synthase (cyclooxygenase)
Type:
Protein
Mol. Mass.:
68976.98
Organism:
Ovis aries (Sheep)
Description:
Residue:
603
  
Inhibitor
Name:
BDBM50070480
Synonyms:
CHEMBL3408787
Type:
Small organic molecule
Emp. Form.:
C18H13Cl4NO5
Mol. Mass.:
465.112
SMILES:
COc1cc(CN2C(=O)c3c(C2=O)c(Cl)c(Cl)c(Cl)c3Cl)cc(OC)c1OC
: