Target
5-hydroxytryptamine receptor 1A
Ligand
BDBM21393
Substrate
Meas. Tech.
ChEMBL_1468610 (CHEMBL3413556)
Ki
0.400000±n/a nM
Citation
 Kolaczkowski, MMarcinkowska, MBucki, ASniecikowska, JPawlowski, MKazek, GSiwek, AJastrzebska-Wiesek, MPartyka, AWasik, AWesolowska, AMierzejewski, PBienkowski, P Novel 5-HT6 receptor antagonists/D2 receptor partial agonists targeting behavioral and psychological symptoms of dementia. Eur J Med Chem 92:221-35 (2015)  
Target
Name:
5-hydroxytryptamine receptor 1A
Synonyms:
5-HT-1A 5-hydroxytryptamine receptor 1A (5-HT-1A) ADRB2RL1 Dopamine D2 receptor and serotonin 1a receptor HTR1A | Serotonin receptor 1A
Type:
Mol. Mass.:
46122.49
Organism:
Homo sapiens (Human)
Description:
Residue:
422
  
Inhibitor
Name:
BDBM21393
Synonyms:
7-(dipropylamino)-5,6,7,8-tetrahydronaphthalen-1-ol 8-OH-DPAT 8-OH-DPAT,(-) CHEMBL1788118 CHEMBL56 US10562853, Compound 8-OH-DPAT cid_1220
Type:
radiolabeled ligand
Emp. Form.:
C16H25NO
Mol. Mass.:
247.3758
SMILES:
CCCN(CCC)C1CCc2cccc(O)c2C1
: