Target
5-hydroxytryptamine receptor 6
Ligand
BDBM50070831
Substrate
Meas. Tech.
ChEMBL_1468594 (CHEMBL3413540)
Ki
0.400000±n/a nM
Citation
 Kolaczkowski, MMarcinkowska, MBucki, ASniecikowska, JPawlowski, MKazek, GSiwek, AJastrzebska-Wiesek, MPartyka, AWasik, AWesolowska, AMierzejewski, PBienkowski, P Novel 5-HT6 receptor antagonists/D2 receptor partial agonists targeting behavioral and psychological symptoms of dementia. Eur J Med Chem 92:221-35 (2015)  
Target
Name:
5-hydroxytryptamine receptor 6
Synonyms:
5-HT-6 5-hydroxytryptamine receptor 6 (5-HT-6) 5-hydroxytryptamine receptor 6 (5HT6) HTR6 Serotonin 6 (5-HT6) receptor | Serotonin Receptor 6
Type:
G Protein-Coupled Receptor (GPCR)
Mol. Mass.:
46968.43
Organism:
Homo sapiens (Human)
Description:
P50406
Residue:
440
  
Inhibitor
Name:
BDBM50070831
Synonyms:
CHEMBL3409238
Type:
Small organic molecule
Emp. Form.:
C31H34N4O4S
Mol. Mass.:
558.691
SMILES:
O=C1CCc2ccc(OCCCCN3CCN(CC3)c3cccc4n(ccc34)S(=O)(=O)c3ccccc3)cc2N1
: