Target
Eukaryotic translation initiation factor 2-alpha kinase 3
Ligand
BDBM50072026
Substrate
Meas. Tech.
ChEMBL_1467740 (CHEMBL3412166)
IC50
5.0±n/a nM
Citation
 Smith, ALAndrews, KLBeckmann, HBellon, SFBeltran, PJBooker, SChen, HChung, YAD'Angelo, NDDao, JDellamaggiore, KRJaeckel, PKendall, RLabitzke, KLong, AMMaterna-Reichelt, SMitchell, PNorman, MHPowers, DRose, MShaffer, PLWu, MMLipford, JR Discovery of 1H-pyrazol-3(2H)-ones as potent and selective inhibitors of protein kinase R-like endoplasmic reticulum kinase (PERK). J Med Chem 58:1426-41 (2015)  
Target
Name:
Eukaryotic translation initiation factor 2-alpha kinase 3
Synonyms:
E2AK3_HUMAN HsPEK PERK Pancreatic endoplasmic reticulum kinase (PERK)
Type:
Enzyme
Mol. Mass.:
125190.66
Organism:
Homo sapiens (Human)
Description:
Q9NZJ5
Residue:
1116
  
Inhibitor
Name:
BDBM50072026
Synonyms:
CHEMBL3407851
Type:
Small organic molecule
Emp. Form.:
C32H24ClN5O3
Mol. Mass.:
562.018
SMILES:
CNc1ncc2ccc(Oc3cc(ccc3Cl)C(=O)c3c(-c4ccccc4)n(C)n(-c4ccccc4)c3=O)cc2n1
: