Target
Serine/threonine-protein kinase Chk1
Ligand
BDBM50072309
Substrate
Meas. Tech.
ChEMBL_1468651 (CHEMBL3413731)
IC50
13±n/a nM
Citation
 Gomha, SMAbdulla, MMAbou-Seri, SM Identification of novel aminothiazole and aminothiadiazole conjugated cyanopyridines as selective CHK1 inhibitors. Eur J Med Chem 92:459-70 (2015)  
Target
Name:
Serine/threonine-protein kinase Chk1
Synonyms:
CHEK1 CHK1 checkpoint homolog Checkpoint kinase-1 (CHK1)
Type:
Enzyme Catalytic Domain
Mol. Mass.:
54443.02
Organism:
Homo sapiens (Human)
Description:
gi_166295192
Residue:
476
  
Inhibitor
Name:
BDBM50072309
Synonyms:
CHEMBL3408389
Type:
Small organic molecule
Emp. Form.:
C29H20ClN5O2S
Mol. Mass.:
538.019
SMILES:
CCOC(=O)c1nn(-c2ccc(Cl)cc2)\c(=N\c2nc(cc(-c3ccccc3)c2C#N)-c2ccccc2)s1
: