Target
Serine/threonine-protein kinase Chk1
Ligand
BDBM50072316
Substrate
Meas. Tech.
ChEMBL_1468651 (CHEMBL3413731)
IC50
2.6±n/a nM
Citation
 Gomha, SMAbdulla, MMAbou-Seri, SM Identification of novel aminothiazole and aminothiadiazole conjugated cyanopyridines as selective CHK1 inhibitors. Eur J Med Chem 92:459-70 (2015)  
Target
Name:
Serine/threonine-protein kinase Chk1
Synonyms:
CHEK1 CHK1 checkpoint homolog Checkpoint kinase-1 (CHK1)
Type:
Enzyme Catalytic Domain
Mol. Mass.:
54443.02
Organism:
Homo sapiens (Human)
Description:
gi_166295192
Residue:
476
  
Inhibitor
Name:
BDBM50072316
Synonyms:
CHEMBL3408396
Type:
Small organic molecule
Emp. Form.:
C42H27N7O2S2
Mol. Mass.:
725.839
SMILES:
O=C(Nc1ccccc1)C1=NN(\C(S1)=C1\S\C(=N/c2nc(cc(-c3ccccc3)c2C#N)-c2ccccc2)N(C1=O)c1ccccc1)c1ccccc1
: