Target
Potassium voltage-gated channel subfamily H member 2
Ligand
BDBM50072309
Substrate
Meas. Tech.
ChEMBL_1468656 (CHEMBL3413736)
IC50
8400±n/a nM
Citation
 Gomha, SMAbdulla, MMAbou-Seri, SM Identification of novel aminothiazole and aminothiadiazole conjugated cyanopyridines as selective CHK1 inhibitors. Eur J Med Chem 92:459-70 (2015)  
Target
Name:
Potassium voltage-gated channel subfamily H member 2
Synonyms:
1,3-beta-glucan synthase component GLS2 ERG Eag-related protein 1 Ether-a-go-go-related gene (HERG) Ether-a-go-go-related gene potassium channel 1 Ether-a-go-go-related gene potassium channel 1 (hERG1) Ether-a-go-go-related protein 1 H-ERG KCNH2 Potassium voltage-gated channel subfamily H member 2 (hERG) Voltage-gated potassium channel subunit Kv11.1 hERG Potassium Channel 1 | putative potassium channel subunit
Type:
Multi-pass membrane protein
Mol. Mass.:
126672.65
Organism:
Homo sapiens (Human)
Description:
Q12809
Residue:
1159
  
Inhibitor
Name:
BDBM50072309
Synonyms:
CHEMBL3408389
Type:
Small organic molecule
Emp. Form.:
C29H20ClN5O2S
Mol. Mass.:
538.019
SMILES:
CCOC(=O)c1nn(-c2ccc(Cl)cc2)\c(=N\c2nc(cc(-c3ccccc3)c2C#N)-c2ccccc2)s1
: