Target
Mitogen-activated protein kinase 1
Ligand
BDBM50072459
Substrate
Meas. Tech.
ChEMBL_1469629 (CHEMBL3412886)
Ki
1.5±n/a nM
Citation
 Ren, LGrina, JMoreno, DBlake, JFGaudino, JJGarrey, RMetcalf, ATBurkard, MMartinson, MRasor, KChen, HDean, BGould, SEPacheco, PShahidi-Latham, SYin, JWest, KWang, WMoffat, JGSchwarz, JB Discovery of highly potent, selective, and efficacious small molecule inhibitors of ERK1/2. J Med Chem 58:1976-91 (2015)  
Target
Name:
Mitogen-activated protein kinase 1
Synonyms:
ERK2 Extracellular signal-regulated kinase 2 Extracellular signal-regulated kinase 2 (ERK2) MAPK 2 MK01_HUMAN Mitogen-activated protein kinase 1 (ERK-2) Mitogen-activated protein kinase 2 PRKM2 | p42-MAPK
Type:
Ser/Thr Protein Kinase
Mol. Mass.:
41392.76
Organism:
Homo sapiens (Human)
Description:
P28482
Residue:
360
  
Inhibitor
Name:
BDBM50072459
Synonyms:
CHEMBL3409602
Type:
Small organic molecule
Emp. Form.:
C21H20ClFN4O3
Mol. Mass.:
430.86
SMILES:
OC[C@H](c1ccc(Cl)c(F)c1)n1ccc(cc1=O)-c1ccnc(N[C@H]2CCOC2)n1
: