Target
Mitogen-activated protein kinase 1
Ligand
BDBM120091
Substrate
Meas. Tech.
ChEMBL_1469629 (CHEMBL3412886)
Ki
2.2±n/a nM
Citation
 Ren, LGrina, JMoreno, DBlake, JFGaudino, JJGarrey, RMetcalf, ATBurkard, MMartinson, MRasor, KChen, HDean, BGould, SEPacheco, PShahidi-Latham, SYin, JWest, KWang, WMoffat, JGSchwarz, JB Discovery of highly potent, selective, and efficacious small molecule inhibitors of ERK1/2. J Med Chem 58:1976-91 (2015)  
Target
Name:
Mitogen-activated protein kinase 1
Synonyms:
ERK2 Extracellular signal-regulated kinase 2 Extracellular signal-regulated kinase 2 (ERK2) MAPK 2 MK01_HUMAN Mitogen-activated protein kinase 1 (ERK-2) Mitogen-activated protein kinase 2 PRKM2 | p42-MAPK
Type:
Ser/Thr Protein Kinase
Mol. Mass.:
41392.76
Organism:
Homo sapiens (Human)
Description:
P28482
Residue:
360
  
Inhibitor
Name:
BDBM120091
Synonyms:
US8697715, 12 | US9259470, 12
Type:
Small organic molecule
Emp. Form.:
C23H24ClFN4O3
Mol. Mass.:
458.913
SMILES:
Cc1cnc(NC2CCOCC2)nc1-c1ccn(C(CO)c2ccc(Cl)c(F)c2)c(=O)c1
: