Target
Glycogen synthase kinase-3 beta
Ligand
BDBM50074675
Substrate
Meas. Tech.
ChEMBL_1468106 (CHEMBL3413879)
IC50
0.370000±n/a nM
Citation
 Sivaprakasam, PHan, XCiviello, RLJacutin-Porte, SKish, KPokross, MLewis, HAAhmed, NSzapiel, NNewitt, JABaldwin, ETXiao, HKrause, CMPark, HNophsker, MLippy, JSBurton, CRLangley, DRMacor, JEDubowchik, GM Discovery of new acylaminopyridines as GSK-3 inhibitors by a structure guided in-depth exploration of chemical space around a pyrrolopyridinone core. Bioorg Med Chem Lett 25:1856-63 (2015)  
Target
Name:
Glycogen synthase kinase-3 beta
Synonyms:
GSK-3 beta GSK3B Glycogen synthase kinase 3 beta (GSK3B) Glycogen synthase kinase-3 beta (GSK-3B) Glycogen synthase kinase-3 beta (GSK3B) Glycogen synthase kinase-3beta (GSK3B) | Serine/threonine-protein kinase GSK3B
Type:
Enzyme
Mol. Mass.:
46756.38
Organism:
Homo sapiens (Human)
Description:
P49841
Residue:
420
  
Inhibitor
Name:
BDBM50074675
Synonyms:
CHEMBL3410092
Type:
Small organic molecule
Emp. Form.:
C17H18N4O3S
Mol. Mass.:
358.415
SMILES:
NC(=O)c1sc(nc1OC1CCC1)-c1ccnc(NC(=O)C2CC2)c1
: