Target
Cholecystokinin receptor type A
Ligand
BDBM50329178
Substrate
Meas. Tech.
ChEMBL_1468337 (CHEMBL3412216)
EC50
0.002±n/a nM
Citation
 Desai, AJHenke, BRMiller, LJ Elimination of a cholecystokinin receptor agonist 'trigger' in an effort to develop positive allosteric modulators without intrinsic agonist activity. Bioorg Med Chem Lett 25:1849-55 (2015)  
Target
Name:
Cholecystokinin receptor type A
Synonyms:
CCK-A receptor CCK1-R CCKAR_HUMAN Cholecystokinin receptor Cholecystokinin-1 Receptor
Type:
G Protein-Coupled Receptor (GPCR)
Mol. Mass.:
47859.34
Organism:
Homo sapiens (Human)
Description:
Stable expression of human CCK-1 receptors in HEK 293 cells.
Residue:
428
  
Inhibitor
Name:
BDBM50329178
Synonyms:
(S)-3-(3-(1-(2-(isopropyl(phenyl)amino)-2-oxoethyl)-2,4-dioxo-5-phenyl-2,3,4,5-tetrahydro-1H-benzo[b][1,4]diazepin-3-yl)ureido)benzoic acid | CHEMBL1269257
Type:
Small organic molecule
Emp. Form.:
C34H31N5O6
Mol. Mass.:
605.6398
SMILES:
CC(C)N(C(=O)CN1c2ccccc2N(c2ccccc2)C(=O)[C@@H](NC(=O)Nc2cccc(c2)C(O)=O)C1=O)c1ccccc1
: