Target
Muscarinic acetylcholine receptor M1
Ligand
BDBM50075195
Substrate
Meas. Tech.
ChEMBL_1473513 (CHEMBL3420196)
EC50
60±n/a nM
Citation
 Chen, XKlöckner, JHolze, JZimmermann, CSeemann, WKSchrage, RBock, AMohr, KTränkle, CHolzgrabe, UDecker, M Rational design of partial agonists for the muscarinic m1 acetylcholine receptor. J Med Chem 58:560-76 (2015)  
Target
Name:
Muscarinic acetylcholine receptor M1
Synonyms:
ACM1_HUMAN Cholinergic receptor, muscarinic 1 | Cholinergic, muscarinic M1
Type:
Protein
Mol. Mass.:
51442.54
Organism:
Homo sapiens (Human)
Description:
P11229
Residue:
460
  
Inhibitor
Name:
BDBM50075195
Synonyms:
CHEMBL3414847
Type:
Small organic molecule
Emp. Form.:
C38H44FN3O5S
Mol. Mass.:
673.836
SMILES:
CC[C@@H]1SC2(CCNCC2)N(CCCCCCCCOc2ccc3cc(Cn4cc(C(O)=O)c(=O)c5cccc(F)c45)ccc3c2)C1=O
: