Target
Muscarinic acetylcholine receptor M1
Ligand
BDBM50448377
Substrate
Meas. Tech.
ChEMBL_1473515 (CHEMBL3420198)
Kd
2138±n/a nM
Citation
 Chen, XKlöckner, JHolze, JZimmermann, CSeemann, WKSchrage, RBock, AMohr, KTränkle, CHolzgrabe, UDecker, M Rational design of partial agonists for the muscarinic m1 acetylcholine receptor. J Med Chem 58:560-76 (2015)  
Target
Name:
Muscarinic acetylcholine receptor M1
Synonyms:
ACM1_HUMAN Cholinergic receptor, muscarinic 1 | Cholinergic, muscarinic M1
Type:
Protein
Mol. Mass.:
51442.54
Organism:
Homo sapiens (Human)
Description:
P11229
Residue:
460
  
Inhibitor
Name:
BDBM50448377
Synonyms:
CHEMBL3121473
Type:
Small organic molecule
Emp. Form.:
C10H17N2O2
Mol. Mass.:
197.2536
SMILES:
C[N+](C)(C)CC#CCOC1=NOCC1
: