Target
Tyrosine-protein kinase SYK
Ligand
BDBM50075815
Substrate
Meas. Tech.
ChEMBL_1473534 (CHEMBL3420413)
IC50
60±n/a nM
Citation
 Ellis, JMAltman, MDBass, AButcher, JWByford, AJDonofrio, AGalloway, SHaidle, AMJewell, JKelly, NLeccese, EKLee, SMaddess, MMiller, JRMoy, LYOsimboni, EOtte, RDReddy, MVSpencer, KSun, BVincent, SHWard, GJWoo, GHYang, CHoushyar, HNorthrup, AB Overcoming mutagenicity and ion channel activity: optimization of selective spleen tyrosine kinase inhibitors. J Med Chem 58:1929-39 (2015)  
Target
Name:
Tyrosine-protein kinase SYK
Synonyms:
KSYK_HUMAN Spleen Tyrosine Kinase Tyrosine-protein kinase SYK (Syk)
Type:
Enzyme
Mol. Mass.:
72079.99
Organism:
Homo sapiens (Human)
Description:
P43405
Residue:
635
  
Inhibitor
Name:
BDBM50075815
Synonyms:
CHEMBL3415603
Type:
Small organic molecule
Emp. Form.:
C19H25N5O2
Mol. Mass.:
355.4341
SMILES:
Cc1cc(C)nc(Nc2cc(N[C@@H]3CCCC[C@@H]3O)cnc2C(N)=O)c1
: