Target
Endoplasmic reticulum aminopeptidase 1
Ligand
BDBM50077025
Substrate
Meas. Tech.
ChEMBL_1473167 (CHEMBL3418219)
IC50
38400±n/a nM
Citation
 Papakyriakou, AZervoudi, ETsoukalidou, SMauvais, FXSfyroera, GMastellos, DCvan Endert, PTheodorakis, EAVourloumis, DStratikos, E 3,4-diaminobenzoic acid derivatives as inhibitors of the oxytocinase subfamily of M1 aminopeptidases with immune-regulating properties. J Med Chem 58:1524-43 (2015)  
Target
Name:
Endoplasmic reticulum aminopeptidase 1
Synonyms:
APPILS Aminopeptidase ERAP1_HUMAN | KIAA0525
Type:
PROTEIN
Mol. Mass.:
107232.03
Organism:
Homo sapiens (Human)
Description:
ChEMBL_1473167
Residue:
941
  
Inhibitor
Name:
BDBM50077025
Synonyms:
CHEMBL3416688
Type:
Small organic molecule
Emp. Form.:
C28H29N5O5
Mol. Mass.:
515.5604
SMILES:
N[C@@H](CCc1ccc(O)cc1)C(=O)Nc1cc(ccc1N)C(=O)N[C@@H](Cc1c[nH]c2ccccc12)C(O)=O
: