Target
Stromelysin-1
Ligand
BDBM50078177
Substrate
Meas. Tech.
ChEMBL_1472743 (CHEMBL3419053)
IC50
10.0±n/a nM
Citation
 Orbe, JSánchez-Arias, JARabal, ORodríguez, JASalicio, AUgarte, ABelzunce, MXu, MWu, WTan, HMa, HPáramo, JAOyarzabal, J Design, synthesis, and biological evaluation of novel matrix metalloproteinase inhibitors as potent antihemorrhagic agents: from hit identification to an optimized lead. J Med Chem 58:2465-88 (2015)  
Target
Name:
Stromelysin-1
Synonyms:
MMP-3 MMP3_HUMAN Matrix metalloproteinase 3 Matrix metalloproteinase-3 (MMP-3) SL-1 Stromelysin 1 | Transin-1
Type:
Enzyme
Mol. Mass.:
53973.13
Organism:
Homo sapiens (Human)
Description:
P08254
Residue:
477
  
Inhibitor
Name:
BDBM50078177
Synonyms:
CHEMBL3417764
Type:
Small organic molecule
Emp. Form.:
C24H30N2O6S
Mol. Mass.:
474.57
SMILES:
COc1ccc(Oc2ccc(cc2)S(=O)(=O)C2(CCC3(C2)CCN(C)CC3)C(=O)NO)cc1
: