Target
Stromelysin-1
Ligand
BDBM50078194
Substrate
Meas. Tech.
ChEMBL_1472743 (CHEMBL3419053)
IC50
114±n/a nM
Citation
 Orbe, JSánchez-Arias, JARabal, ORodríguez, JASalicio, AUgarte, ABelzunce, MXu, MWu, WTan, HMa, HPáramo, JAOyarzabal, J Design, synthesis, and biological evaluation of novel matrix metalloproteinase inhibitors as potent antihemorrhagic agents: from hit identification to an optimized lead. J Med Chem 58:2465-88 (2015)  
Target
Name:
Stromelysin-1
Synonyms:
MMP-3 MMP3_HUMAN Matrix metalloproteinase 3 Matrix metalloproteinase-3 (MMP-3) SL-1 Stromelysin 1 | Transin-1
Type:
Enzyme
Mol. Mass.:
53973.13
Organism:
Homo sapiens (Human)
Description:
P08254
Residue:
477
  
Inhibitor
Name:
BDBM50078194
Synonyms:
CHEMBL3417747
Type:
Small organic molecule
Emp. Form.:
C24H28F3N3O5S
Mol. Mass.:
527.556
SMILES:
ONC(=O)C1(CCC2(C1)CCNCC2)S(=O)(=O)c1ccc(NCc2ccc(OC(F)(F)F)cc2)cc1
: