Target
Lysine-specific histone demethylase 1A
Ligand
BDBM50346863
Substrate
Meas. Tech.
ChEMBL_1472633 (CHEMBL3418202)
IC50
19±n/a nM
Citation
 Valente, SRodriguez, VMercurio, CVianello, PSaponara, BCirilli, RCiossani, GLabella, DMarrocco, BMonaldi, DRuoppolo, GTilset, MBotrugno, OADessanti, PMinucci, SMattevi, AVarasi, MMai, A Pure enantiomers of benzoylamino-tranylcypromine: LSD1 inhibition, gene modulation in human leukemia cells and effects on clonogenic potential of murine promyelocytic blasts. Eur J Med Chem 94:163-74 (2015)  
Target
Name:
Lysine-specific histone demethylase 1A
Synonyms:
AOF2 Flavin-containing amine oxidase domain-containing protein 2 KDM1A KIAA0601 Lysine-specific demethylase 1 (LSD1) Lysine-specific histone demethylase 1 (LSD1)
Type:
Enzyme
Mol. Mass.:
92901.01
Organism:
Homo sapiens (Human)
Description:
O60341
Residue:
852
  
Inhibitor
Name:
BDBM50346863
Synonyms:
CHEMBL1797640 | US8765820, 5b
Type:
Small organic molecule
Emp. Form.:
C16H16N2O
Mol. Mass.:
252.311
SMILES:
NC1CC1c1ccc(NC(=O)c2ccccc2)cc1
: