Target
Adenosine receptor A2a
Ligand
BDBM50079332
Substrate
Meas. Tech.
ChEMBL_1472822 (CHEMBL3419484)
Ki
72±n/a nM
Citation
 Preti, DBaraldi, PGSaponaro, GRomagnoli, RAghazadeh Tabrizi, MBaraldi, SCosconati, SBruno, ANovellino, EVincenzi, FRavani, ABorea, PAVarani, K Design, synthesis, and biological evaluation of novel 2-((2-(4-(substituted)phenylpiperazin-1-yl)ethyl)amino)-5'-N-ethylcarboxamidoadenosines as potent and selective agonists of the A2A adenosine receptor. J Med Chem 58:3253-67 (2015)  
Target
Name:
Adenosine receptor A2a
Synonyms:
A2A adenosine receptor (hA2A) ADENOSINE A2 ADORA2 Adenosine A2A receptor (A2AAR)
Type:
G Protein-Coupled Receptor (GPCR)
Mol. Mass.:
44716.46
Organism:
Homo sapiens (Human)
Description:
P29274
Residue:
412
  
Inhibitor
Name:
BDBM50079332
Synonyms:
CHEMBL3416791
Type:
Small organic molecule
Emp. Form.:
C25H33N9O6
Mol. Mass.:
555.5862
SMILES:
CCNC(=O)[C@H]1O[C@H]([C@H](O)[C@@H]1O)n1cnc2c(N)nc(NCCN3CCN(CC3)c3cccc(c3)C(O)=O)nc12
: