Target
MAP kinase-interacting serine/threonine-protein kinase 2
Ligand
BDBM50298223
Substrate
Meas. Tech.
ChEMBL_1470961 (CHEMBL3419829)
Ki
880±n/a nM
Citation
 Yu, MLi, PBasnet, SKKumarasiri, MDiab, STeo, TAlbrecht, HWang, S Discovery of 4-(dihydropyridinon-3-yl)amino-5-methylthieno[2,3-d]pyrimidine derivatives as potent Mnk inhibitors: synthesis, structure-activity relationship analysis and biological evaluation. Eur J Med Chem 95:116-26 (2015)  
Target
Name:
MAP kinase-interacting serine/threonine-protein kinase 2
Synonyms:
GPRK7 MAP kinase-interacting serine/threonine-protein kinase 2 (MKNK2) MAP-kinase interacting kinase 2 (MNK2) MKNK2_HUMAN | MNK2
Type:
Protein
Mol. Mass.:
51870.79
Organism:
Homo sapiens (Human)
Description:
Q9HBH9
Residue:
465
  
Inhibitor
Name:
BDBM50298223
Synonyms:
CGP-57380 CHEMBL576817 | N-(4-fluorophenyl)-3H-pyrazolo[3,4-d]pyrimidine-3,4-diamine
Type:
Small organic molecule
Emp. Form.:
C11H9FN6
Mol. Mass.:
244.2278
SMILES:
Nc1ncnc2n[nH]c(Nc3ccc(F)cc3)c12
: