Target
Protein mono-ADP-ribosyltransferase PARP10
Ligand
BDBM50079612
Substrate
Meas. Tech.
ChEMBL_1472392 (CHEMBL3420113)
IC50
1900±n/a nM
Citation
 Ekblad, TLindgren, AEAndersson, CDCaraballo, RThorsell, AGKarlberg, TSpjut, SLinusson, ASchüler, HElofsson, M Towards small molecule inhibitors of mono-ADP-ribosyltransferases. Eur J Med Chem 95:546-51 (2015)  
Target
Name:
Protein mono-ADP-ribosyltransferase PARP10
Synonyms:
2.4.2.- ADP-ribosyltransferase diphtheria toxin-like 10 Human diphtheria toxin-like ADP-ribosyltransferase (ARTD10 or PARP10, L926Y)) Human diphtheria toxin-like ADP-ribosyltransferase (ARTD10 or PARP10, S927A)) PARP-10 Poly [ADP-ribose] polymerase 10
Type:
Mol. Mass.:
109953.63
Organism:
Homo sapiens (Human)
Description:
Q53GL7
Residue:
1025
  
Inhibitor
Name:
BDBM50079612
Synonyms:
CHEMBL3414756
Type:
Small organic molecule
Emp. Form.:
C11H12N2O4
Mol. Mass.:
236.224
SMILES:
NC(=O)c1cccc(NC(=O)CCC(O)=O)c1
: