Target
Histone acetyltransferase p300
Ligand
BDBM50081125
Substrate
Meas. Tech.
ChEMBL_1475670 (CHEMBL3424829)
IC50
2900±n/a nM
Citation
 Milite, CFeoli, ASasaki, KLa Pietra, VBalzano, ALMarinelli, LMai, ANovellino, ECastellano, STosco, ASbardella, G A novel cell-permeable, selective, and noncompetitive inhibitor of KAT3 histone acetyltransferases from a combined molecular pruning/classical isosterism approach. J Med Chem 58:2779-98 (2015)  
Target
Name:
Histone acetyltransferase p300
Synonyms:
EP300 HIF1A/p300/CREB-binding protein P300
Type:
Protein
Mol. Mass.:
264223.04
Organism:
Homo sapiens (Human)
Description:
Q09472
Residue:
2414
  
Inhibitor
Name:
BDBM50081125
Synonyms:
CHEMBL3421961
Type:
Small organic molecule
Emp. Form.:
C27H24N2O4
Mol. Mass.:
440.4905
SMILES:
[#6]-c1cc(-[#8])cc(-[#6])c1\[#6]=[#6]-1/[#6](=O)-[#7](-[#6]-c2ccccc2)-[#6](=O)-[#7](-[#6]-c2ccccc2)-[#6]-1=O
: