Target
Histone acetyltransferase KAT2B
Ligand
BDBM50292429
Substrate
Meas. Tech.
ChEMBL_1475662 (CHEMBL3424791)
IC50
33900±n/a nM
Citation
 Milite, CFeoli, ASasaki, KLa Pietra, VBalzano, ALMarinelli, LMai, ANovellino, ECastellano, STosco, ASbardella, G A novel cell-permeable, selective, and noncompetitive inhibitor of KAT3 histone acetyltransferases from a combined molecular pruning/classical isosterism approach. J Med Chem 58:2779-98 (2015)  
Target
Name:
Histone acetyltransferase KAT2B
Synonyms:
Histone acetyltransferase KAT2A/KAT2B KAT2B PCAF
Type:
PROTEIN
Mol. Mass.:
93045.76
Organism:
Homo sapiens (Human)
Description:
ChEMBL_1502838
Residue:
832
  
Inhibitor
Name:
BDBM50292429
Synonyms:
2-Hydroxy-6-pentadecyl-benzoic acid 2-hydroxy-6-((8Z,11Z)-pentadeca-8,11,14-trienyl)benzoic acid 6-[8(Z),11(Z),14-pentadecatrienyl]salicylic acid 6-pentadecylsalicylic acid 6[8'(Z ),11'(Z ),14'-pentadecatrienyl]salicylicacid CHEMBL455368 | anacardic acid
Type:
Small organic molecule
Emp. Form.:
C22H30O3
Mol. Mass.:
342.4718
SMILES:
OC(=O)c1c(O)cccc1CCCCCCC\C=C/C\C=C/CC=C
: