Target
Histone acetyltransferase p300
Ligand
BDBM50081160
Substrate
Meas. Tech.
ChEMBL_1475663 (CHEMBL3424792)
IC50
1600±n/a nM
Citation
 Milite, CFeoli, ASasaki, KLa Pietra, VBalzano, ALMarinelli, LMai, ANovellino, ECastellano, STosco, ASbardella, G A novel cell-permeable, selective, and noncompetitive inhibitor of KAT3 histone acetyltransferases from a combined molecular pruning/classical isosterism approach. J Med Chem 58:2779-98 (2015)  
Target
Name:
Histone acetyltransferase p300
Synonyms:
EP300 HIF1A/p300/CREB-binding protein P300
Type:
Protein
Mol. Mass.:
264223.04
Organism:
Homo sapiens (Human)
Description:
Q09472
Residue:
2414
  
Inhibitor
Name:
BDBM50081160
Synonyms:
CHEMBL3421941
Type:
Small organic molecule
Emp. Form.:
C25H20N2O5
Mol. Mass.:
428.4367
SMILES:
[#8]-c1ccc(\[#6]=[#6]-2\[#6](=O)-[#7](-[#6]-c3ccccc3)-[#6](=O)-[#7](-[#6]-c3ccccc3)-[#6]-2=O)cc1-[#8]
: