Target
Histone acetyltransferase p300
Ligand
BDBM50081165
Substrate
Meas. Tech.
ChEMBL_1475663 (CHEMBL3424792)
IC50
8500±n/a nM
Citation
 Milite, CFeoli, ASasaki, KLa Pietra, VBalzano, ALMarinelli, LMai, ANovellino, ECastellano, STosco, ASbardella, G A novel cell-permeable, selective, and noncompetitive inhibitor of KAT3 histone acetyltransferases from a combined molecular pruning/classical isosterism approach. J Med Chem 58:2779-98 (2015)  
Target
Name:
Histone acetyltransferase p300
Synonyms:
EP300 HIF1A/p300/CREB-binding protein P300
Type:
Protein
Mol. Mass.:
264223.04
Organism:
Homo sapiens (Human)
Description:
Q09472
Residue:
2414
  
Inhibitor
Name:
BDBM50081165
Synonyms:
CHEMBL3421947
Type:
Small organic molecule
Emp. Form.:
C19H24N2O4
Mol. Mass.:
344.4049
SMILES:
[#6]-[#6](-[#6])-[#6]-[#7]-1-[#6](=O)-[#7](-[#6]-[#6](-[#6])-[#6])-[#6](=O)\[#6](=[#6]/c2ccc(-[#8])cc2)-[#6]-1=O
: