Target
Histone acetyltransferase p300
Ligand
BDBM50081170
Substrate
Meas. Tech.
ChEMBL_1475663 (CHEMBL3424792)
IC50
1600±n/a nM
Citation
 Milite, CFeoli, ASasaki, KLa Pietra, VBalzano, ALMarinelli, LMai, ANovellino, ECastellano, STosco, ASbardella, G A novel cell-permeable, selective, and noncompetitive inhibitor of KAT3 histone acetyltransferases from a combined molecular pruning/classical isosterism approach. J Med Chem 58:2779-98 (2015)  
Target
Name:
Histone acetyltransferase p300
Synonyms:
EP300 HIF1A/p300/CREB-binding protein P300
Type:
Protein
Mol. Mass.:
264223.04
Organism:
Homo sapiens (Human)
Description:
Q09472
Residue:
2414
  
Inhibitor
Name:
BDBM50081170
Synonyms:
CHEMBL3421960
Type:
Small organic molecule
Emp. Form.:
C26H23N3O6
Mol. Mass.:
473.4773
SMILES:
CC1=NN(C(=O)\C1=C/Cc1ccc(Cc2cc(C)c(C)cc2[N+]([O-])=O)o1)c1ccc(cc1)C(O)=O
: